{"text_format":"1","workbook":"xlsx","n_sheets":7,"sheets":["Additionals Import","Additionals Export","Fuel","ETS","DATA","GEO","PORTS"],"not_rendered":{"charts":0,"images":3,"macros":1,"external_links":0,"defined_names":5,"comments":0,"pivot_tables":0},"unopened":[],"bounds":{"document_bytes":16777216,"sheet_cells":100000,"rows_first":2000,"rows_last":500,"rows_between":2000,"halvings":0,"cell_chars":16384,"cell_head_chars":4096},"cells_cut":0,"cells_raw":0,"read":"whole","date_system":"1900"}

{"sheet":"Additionals Import","index":0,"n_rows":40,"n_cols":13,"rows_kept":40,"cut":false,"hidden":false,"merged":[[29,8,29,9],[29,10,29,11],[29,12,29,13],[27,8,27,9],[27,10,27,11],[27,12,27,13],[28,8,28,9],[28,10,28,11],[28,12,28,13],[25,8,25,9],[25,10,25,11],[25,12,25,13],[26,8,26,9],[26,10,26,11],[26,12,26,13],[22,8,22,9],[22,10,22,11],[22,12,22,13],[24,8,24,9],[24,10,24,11],[24,12,24,13],[21,12,21,13],[19,8,19,9],[19,10,19,11],[19,12,19,13],[20,8,20,9],[20,10,20,11],[20,12,20,13],[21,8,21,9],[21,10,21,11],[26,1,26,3],[26,4,26,5],[26,6,26,7],[29,1,29,3],[29,4,29,5],[29,6,29,7],[27,1,27,3],[27,4,27,5],[27,6,27,7],[28,1,28,3],[28,4,28,5],[28,6,28,7],[24,4,24,5],[24,6,24,7],[22,1,22,3],[25,1,25,3],[25,4,25,5],[25,6,25,7],[20,1,20,3],[20,4,20,5],[20,6,20,7],[22,4,22,5],[22,6,22,7],[21,1,21,3],[21,4,21,5],[21,6,21,7],[16,6,16,7],[14,4,14,5],[14,6,14,7],[19,4,19,5],[19,6,19,7],[17,7,17,8],[15,8,15,9],[14,8,14,9],[14,10,14,11],[14,12,14,13],[15,1,15,3],[15,4,15,5],[15,6,15,7],[15,10,15,11],[15,12,15,13]]}
[]
[]
[]
[]
[null,"Aktuella tillägg Import"]
[null,"Current additionals Import"]
[]
[null,"Varje månad publicerar vi uppgifter om bränsle- och valutatillägg (DMT & BAF) samt övriga tillägg som DB Schenker använder."]
[null,"Dessa tillägg bestäms av våra leverantörer och är därför svåra för oss på DB Schenker att påverka. Observera att det är skeppningsdatumet som avgör vilka tillägg som gäller. "]
[]
[null,"Every month, we publish information on fuel and currency additionals (Fuel & BAF) as well as other additionals that DB Schenker applies."]
[null,"These additionals are determined by our suppliers and are therefore difficult for us at DB Schenker to influence. Please note that it is the shipping date that determines which additionals that applies."]
[]
[]
[null,"Peak Season Surcharges",null,null,"Area/Country",null,"Validity from:",null,"Validity to:",null,"FCL",null,"LCL"]
[null,"Far East",null,null,"Asia excl ISC/AU/NZ",null,"2023-08-15",null,"until further notice",null,0,null,0]
[null,"Turkey",null,null,"TR",null,"2022-03-01",null,"until further notice",null,0,null,0]
[null,"ISC",null,null,"IN/PK/LK/BD",null,"2022-03-01",null,"until further notice",null,0,null,0]
[]
[null,"Congestion Fee",null,null,"Area/Country",null,"Validity from:",null,"Validity to:",null,"FCL",null,"LCL"]
{"$rows_left_out":21}
{"sheet":"Additionals Export","index":1,"n_rows":82,"n_cols":13,"rows_kept":82,"cut":false,"hidden":false,"merged":[[71,1,71,3],[71,4,71,5],[71,6,71,7],[71,8,71,9],[71,10,71,11],[71,12,71,13],[70,1,70,3],[70,4,70,5],[70,6,70,7],[70,8,70,9],[70,10,70,11],[70,12,70,13],[69,1,69,3],[69,4,69,5],[69,6,69,7],[69,8,69,9],[69,10,69,11],[69,12,69,13],[68,1,68,3],[68,4,68,5],[68,6,68,7],[68,8,68,9],[68,10,68,11],[68,12,68,13],[67,1,67,3],[67,4,67,5],[67,6,67,7],[67,8,67,9],[67,10,67,11],[67,12,67,13],[66,1,66,3],[66,4,66,5],[66,6,66,7],[66,8,66,9],[66,10,66,11],[66,12,66,13],[65,1,65,3],[65,4,65,5],[65,6,65,7],[65,8,65,9],[65,10,65,11],[65,12,65,13],[64,1,64,3],[64,4,64,5],[64,6,64,7],[64,8,64,9],[64,10,64,11],[64,12,64,13],[63,1,63,3],[63,4,63,5],[63,6,63,7],[63,8,63,9],[63,10,63,11],[63,12,63,13],[61,4,61,5],[61,6,61,7],[61,8,61,9],[61,10,61,11],[61,12,61,13],[61,1,61,3],[60,4,60,5],[60,6,60,7],[60,8,60,9],[60,10,60,11],[60,12,60,13],[59,1,59,3],[59,4,59,5],[59,6,59,7],[59,8,59,9],[59,10,59,11],[59,12,59,13],[60,1,60,3],[57,12,57,13],[58,1,58,3],[58,4,58,5],[58,6,58,7],[58,8,58,9],[58,10,58,11],[58,12,58,13],[56,4,56,5],[56,6,56,7],[56,8,56,9],[56,10,56,11],[56,12,56,13],[57,1,57,3],[57,4,57,5],[57,6,57,7],[57,8,57,9],[57,10,57,11],[53,1,53,3],[53,4,53,5],[53,6,53,7],[53,8,53,9],[53,10,53,11],[53,12,53,13],[52,1,52,3],[52,4,52,5],[52,6,52,7],[52,8,52,9],[52,10,52,11],[52,12,52,13],[51,1,51,3],[51,4,51,5],[51,6,51,7],[51,8,51,9],[51,10,51,11],[51,12,51,13],[49,8,49,9],[49,10,49,11],[49,12,49,13],[50,1,50,3],[50,4,50,5],[50,6,50,7],[50,8,50,9],[50,10,50,11],[50,12,50,13],[47,8,47,9],[47,10,47,11],[47,12,47,13],[48,8,48,9],[48,10,48,11],[48,12,48,13],[45,8,45,9],[45,10,45,11],[45,12,45,13],[46,8,46,9],[46,10,46,11],[46,12,46,13],[43,8,43,9],[43,10,43,11],[43,12,43,13],[44,1,44,3],[44,8,44,9],[44,10,44,11],[44,12,44,13],[41,8,41,9],[41,10,41,11],[41,12,41,13],[42,8,42,9],[42,10,42,11],[42,12,42,13],[42,1,42,3],[42,4,42,5],[42,6,42,7],[44,4,44,5],[44,6,44,7],[37,8,37,9],[37,10,37,11],[37,12,37,13],[40,8,40,9],[40,10,40,11],[40,12,40,13],[35,8,35,9],[35,10,35,11],[35,12,35,13],[36,8,36,9],[36,10,36,11],[36,12,36,13],[25,1,25,3],[25,4,25,5],[25,6,25,7],[25,8,25,9],[25,10,25,11],[25,12,25,13],[30,8,30,9],[30,10,30,11],[30,12,30,13],[28,8,28,9],[28,10,28,11],[29,1,29,3],[26,4,26,5],[26,6,26,7],[27,1,27,3],[27,4,27,5],[27,6,27,7],[29,4,29,5],[29,6,29,7],[28,1,28,3],[28,4,28,5],[28,6,28,7],[26,1,26,3],[32,8,32,9],[32,10,32,11],[32,12,32,13],[34,8,34,9],[34,10,34,11],[34,12,34,13],[19,8,19,9],[19,10,19,11],[19,12,19,13],[31,8,31,9],[31,10,31,11],[31,12,31,13],[28,12,28,13],[29,8,29,9],[29,10,29,11],[29,12,29,13],[26,8,26,9],[26,10,26,11],[26,12,26,13],[27,8,27,9],[27,10,27,11],[27,12,27,13],[23,8,23,9],[23,10,23,11],[23,12,23,13],[24,8,24,9],[24,10,24,11],[24,12,24,13],[20,8,20,9],[21,10,21,11],[20,12,20,13],[22,8,22,9],[22,10,22,11],[22,12,22,13],[21,8,21,9],[21,12,21,13],[18,8,18,9],[18,10,18,11],[18,12,18,13],[14,8,14,9],[14,10,14,11],[14,12,14,13],[15,8,15,9],[15,10,15,11],[15,12,15,13],[16,8,16,9],[16,10,16,11],[17,8,17,9],[17,10,17,11],[48,1,48,3],[48,4,48,5],[48,6,48,7],[49,1,49,3],[49,4,49,5],[49,6,49,7],[46,1,46,3],[46,4,46,5],[46,6,46,7],[47,1,47,3],[47,4,47,5],[47,6,47,7],[45,1,45,3],[45,4,45,5],[45,6,45,7],[43,1,43,3],[43,4,43,5],[40,4,40,5],[40,6,40,7],[41,1,41,3],[41,4,41,5],[41,6,41,7],[43,6,43,7],[36,1,36,3],[36,4,36,5],[36,6,36,7],[37,1,37,3],[37,4,37,5],[37,6,37,7],[34,4,34,5],[34,6,34,7],[35,1,35,3],[35,4,35,5],[35,6,35,7],[32,1,32,3],[32,4,32,5],[32,6,32,7],[30,1,30,3],[30,4,30,5],[30,6,30,7],[31,1,31,3],[31,4,31,5],[31,6,31,7],[23,1,23,3],[23,4,23,5],[23,6,23,7],[24,1,24,3],[24,4,24,5],[24,6,24,7],[20,1,20,3],[20,4,20,5],[20,6,20,7],[22,1,22,3],[22,4,22,5],[22,6,22,7],[21,1,21,3],[21,4,21,5],[21,6,21,7],[18,1,18,3],[18,4,18,5],[18,6,18,7],[19,1,19,3],[19,4,19,5],[19,6,19,7],[14,4,14,5],[14,6,14,7],[15,1,15,3],[15,4,15,5],[15,6,15,7],[16,1,16,3],[16,4,16,5],[16,6,16,7],[17,1,17,3],[17,4,17,5],[17,6,17,7]]}
[]
[]
[]
[]
[null,"Aktuella tillägg Export"]
[null,"Current additionals Export"]
[]
[null,"Varje månad publicerar vi uppgifter om bränsle- och valutatillägg (DMT & BAF) samt övriga tillägg som DB Schenker använder."]
[null,"Dessa tillägg bestäms av våra leverantörer och är därför svåra för oss på DB Schenker att påverka. Observera att det är skeppningsdatumet som avgör vilka tillägg som gäller. "]
[]
[null,"Every month, we publish information on fuel and currency additionals (Fuel & BAF) as well as other additionals that DB Schenker applies."]
[null,"These additionals are determined by our suppliers and are therefore difficult for us at DB Schenker to influence. Please note that it is the shipping date that determines which additionals that applies."]
[]
[]
[null,"Peak Season Surcharges",null,null,"Area/Country",null,"Validity from:",null,"Validity to:",null,"FCL",null,"LCL"]
[null,"North America - PSS",null,null,"US/CA/MX",null,"2024-09-01",null,"2024-10-31",null,"20ft: 600 USD / 40ft: 800 USD",null,"USD 38 per W/M"]
[null,"North America - Low Water Surcharge (LWS)",null,null,"CA",null,"2024-10-15",null,"until further notice",null,"20ft: 150 USD / 40ft: 300 USD"]
[null,"North America - Congestion Surcharge (CGS)",null,null,"CA",null,"2024-11-25",null,"until further notice",null,"20ft: 400 USD / 40ft: 600 USD / RF: 1000 USD"]
[]
[null,"Oceania",null,null,"AU/NZ",null,"2024-07-01",null,"until further notice",null,"USD 500 per TEU",null,"USD 20 per W/M"]
{"$rows_left_out":63}
{"sheet":"Fuel","index":2,"n_rows":18,"n_cols":10,"rows_kept":18,"cut":false,"hidden":false,"merged":[[4,2,4,3],[4,5,4,6],[4,8,4,9]]}
[]
[null,null,"Schenker Ocean - Fuel"]
[]
[]
[null,null,2022,null,null,2023,null,null,2024]
[]
[null,null,"Januari",0.36,null,"Januari","FCL:50,7% LCL:46,37% Rail:12,26%",null,"Januari","FCL:45,7% LCL:44,2% Rail:14,57%"]
[null,null,"Februari",0.37640000000000001,null,"Februari","FCL:51,2% LCL:46,4% Rail:13,14%",null,"Februari","FCL:37,7% LCL:34,21% Rail:10,53%"]
[null,null,"Mars",0.40710000000000002,null,"Mars","FCL:48,1% LCL:45,77% Rail:13,39%",null,"Mars","FCL:38,4% LCL:34,37% Rail:12,14%"]
[null,null,"April",0.5071,null,"April","FCL:45,7% LCL:43,67% Rail:14,52%",null,"April","FCL:37,7% LCL:33,92% Rail:10,65%"]
[null,null,"Maj","FCL:55,0% LCL: 49,45%",null,"Maj","FCL:44,2% LCL:42,44% Rail:14,08%",null,"Maj","FCL:38,1% LCL:34,47% Rail:10,54%"]
[null,null,"Juni","FCL:52,0% LCL: 47,71%",null,"Juni","FCL:41,2% LCL:39,65% Rail:13,05%",null,"Juni","FCL:36,1% LCL:32,92% Rail:9,99%"]
[null,null,"Juli","FCL:57,7% LCL: 50,12%",null,"Juli","FCL:42,6% LCL:40,99% Rail:13,95%",null,"Juli","FCL:35,3% LCL:31,92% Rail:10,39%"]
[null,null,"Augusti","FCL:57,7% LCL:51,94%",null,"Augusti","FCL:42,6% LCL:42,65% Rail:13,95%",null,"Augusti","FCL:35,3% LCL:31,92% Rail:10,39%"]
[null,null,"September","FCL:53,7% LCL:47,01%",null,"September","FCL:49,0% LCL:45,55% Rail:15,53%",null,"September","FCL:35,1% LCL:31,67% Rail:10,39%"]
[null,null,"Oktober","FCL:53,0% LCL: 48,36% Rail:13,76%",null,"Oktober","FCL:53,9% LCL:49,54% Rail:16,79%",null,"Oktober","FCL:33,49% LCL:29,49% Rail:8,54%"]
[null,null,"November","FCL:61,0% LCL: 52,05% Rail:15,20%",null,"November","FCL:53,2% LCL:50,04% Rail:16,72%",null,"November","FCL:33,8% LCL:29,88% Rail:8,66%"]
[null,null,"December","FCL:57,7% LCL:53,64% Rail:14,44%",null,"December","FCL:49,8% LCL:47,68% Rail:15,86%",null,"December","FCL:34,7% LCL:31% Rail:9,24%"]

{"sheet":"ETS","index":3,"n_rows":341,"n_cols":9,"rows_kept":341,"cut":false,"hidden":false,"merged":[[3,4,3,8]]}
[]
[]
[]
[null,null,null,null,"2024-10-24"]
["Region","Subregion","Area","Area Name","Schenker ETS 20'","Schenker ETS 40'/40HC","Schenker ETS 20RE","Schenker ETS 40RE","w/m"]
["MEA_EUR","AFR_MED","AFREAST_EURMEDBS","AFRICA EAST_EUR MED BLACK SEA",37,{"$f":"E6*2","v":74},{"$f":"E6*1.7","v":62.9},{"$f":"F6*1.7","v":125.8},{"$f":"ROUNDUP(F6/45,0)","v":2}]
["MEA_EUR","AFR_MED","AFREAST_EURMEDEAST","AFRICA EAST_EUR MED EAST",37,{"$f":"E7*2","v":74},{"$f":"E7*1.7","v":62.9},125.8,{"$f":"ROUNDUP(F7/45,0)","v":2}]
["MEA_EUR","AFR_MED","AFREAST_EURMEDWEST","AFRICA EAST_EUR MED WEST",37,74,62.9,125.8,2]
["MEA_EUR","AFR_MED","AFRLEVANTE_EURMEDBS","AFRICA LEVANTE_EUR MED BLACK SEA",37,74,62.9,125.8,2]
["MEA_EUR","AFR_MED","AFRLEVANTE_EURMEDEAST","AFRICA LEVANTE_EUR MED EAST",37,74,62.9,125.8,2]
["MEA_EUR","AFR_MED","AFRLEVANTE_EURMEDWEST","AFRICA LEVANTE_EUR MED WEST",37,74,62.9,125.8,2]
["MEA_EUR","AFR_MED","AFRNORTH_EURMEDBS","AFRICA NORTH_EUR MED BLACK SEA",37,74,62.9,125.8,2]
["MEA_EUR","AFR_MED","AFRNORTH_EURMEDEAST","AFRICA NORTH_EUR MED EAST",37,74,62.9,125.8,2]
["MEA_EUR","AFR_MED","AFRNORTH_EURMEDWEST","AFRICA NORTH_EUR MED WEST",37,74,62.9,125.8,2]
["MEA_EUR","AFR_MED","AFRREDSEA_EURMEDBS","AFRICA RED SEA_EUR MED BLACK SEA",37,74,62.9,125.8,2]
["MEA_EUR","AFR_MED","AFRREDSEA_EURMEDEAST","AFRICA RED SEA_EUR MED EAST",37,74,62.9,125.8,2]
["MEA_EUR","AFR_MED","AFRREDSEA_EURMEDWEST","AFRICA RED SEA_EUR MED WEST",37,74,62.9,125.8,2]
["MEA_EUR","AFR_MED","AFRSOUTH_EURMEDBS","AFRICA SOUTH_EUR MED BLACK SEA",37,74,62.9,125.8,2]
["MEA_EUR","AFR_MED","AFRSOUTH_EURMEDEAST","AFRICA SOUTH_EUR MED EAST",37,74,62.9,125.8,2]
["MEA_EUR","AFR_MED","AFRSOUTH_EURMEDWEST","AFRICA SOUTH_EUR MED WEST",37,74,62.9,125.8,2]
{"$rows_left_out":322}
{"sheet":"DATA","index":4,"n_rows":12,"n_cols":12,"rows_kept":12,"cut":false,"hidden":true,"merged":[]}
["Region","Sub-Region",null,null,null,null,null,null,null,null,"War-Risk"]
["All*","CA",null,null,null,"Country",{"$f":"#REF!","v":{"$error":"#REF!"}}]
["Africa","East Africa",null,null,null,"Port",{"$f":"#REF!","v":{"$error":"#REF!"}},null,null,null,"Country Code","Country Name"]
["APAC","Far East",null,null,null,"Country Code",{"$f":"_xlfn.XLOOKUP($G$2,Tabell13[Country Name],Tabell13[Country Code])","v":{"$error":"#REF!"}},null,null,null,"IQ","Iraq"]
["Central America","ISC",null,null,null,"Region",{"$f":"_xlfn.XLOOKUP($G$2,Tabell13[Country Name],Tabell13[Region])","v":{"$error":"#REF!"}},null,null,null,"KW","Kuwait"]
["Europe","MX",null,null,null,"Sub-region",{"$f":"_xlfn.XLOOKUP($G$2,Tabell13[Country Name],Tabell13[Sub-region])","v":{"$error":"#REF!"}},null,null,null,"OM","Oman"]
["Mediterranean","Oceania",null,null,null,null,null,null,null,null,"QA","Qatar"]
["Middle East","South Africa",null,null,null,null,null,null,null,null,"SA","Saudi Arabia"]
["North America","South America East Coast",null,null,null,null,null,null,null,null,"AE","United Arab Emirates"]
["South America","South America West Coast"]
[null,"US"]
[null,"West Africa"]

{"sheet":"GEO","index":5,"n_rows":126,"n_cols":17,"rows_kept":126,"cut":false,"hidden":true,"merged":[]}
[{"$f":"\"GEO!A3:A\"&COUNTA(A3:A145)+2","v":"GEO!A3:A92"},{"$f":"\"GEO!B3:B\"&COUNTA(B3:B145)+2","v":"GEO!B3:B92"},{"$f":"\"GEO!C3:C\"&COUNTA(C3:C145)+2","v":"GEO!C3:C92"},{"$f":"\"GEO!D3:D\"&COUNTA(D3:D145)+2","v":"GEO!D3:D67"},null,null,null,{"$f":"\"GEO!H3:H\"&COUNTA(H3:H89)+2","v":"GEO!H3:H89"}]
["Country Code","Country Name","Region","Sub-region",null,"If Found","Frequency","Searchable List",null,null,null,"Removed"]
["AR","Argentina","South America","South America East Coast",null,{"$f":"--ISNUMBER(FIND($F$1,B3))","v":1},{"$f":"IF(F3=1,COUNTIF($F$3:$F3,1),\"\")","v":1},{"$f":"IFERROR(INDEX($B$3:$B$215,MATCH(ROWS($G$3:$G3),$G$3:$G$214,0)),\"\")","v":"Argentina"},null,null,null,"AL","albania","Europe",null,null,{"$f":"_xlfn._xlws.FILTER(Tabell13[Sub-region],Tabell13[Country Code]=Tabell13[[#This Row],[Country Code]],\"\")","v":"South America East Coast"}]
["AU","Australia","APAC","Oceania",null,{"$f":"--ISNUMBER(FIND($F$1,B4))","v":1},{"$f":"IF(F4=1,COUNTIF($F$3:$F4,1),\"\")","v":2},{"$f":"IFERROR(INDEX($B$3:$B$215,MATCH(ROWS($G$3:$G4),$G$3:$G$214,0)),\"\")","v":"Australia"},null,null,null,"DZ","algeria","Mediterranean"]
["BH","Bahrain","Middle East",null,null,1,{"$f":"IF(F5=1,COUNTIF($F$3:$F5,1),\"\")","v":3},{"$f":"IFERROR(INDEX($B$3:$B$215,MATCH(ROWS($G$3:$G5),$G$3:$G$214,0)),\"\")","v":"Bahrain"},null,null,null,"AS","american samoa","-"]
["BD","Bangladesh","APAC","ISC",null,1,{"$f":"IF(F6=1,COUNTIF($F$3:$F6,1),\"\")","v":4},{"$f":"IFERROR(INDEX($B$3:$B$215,MATCH(ROWS($G$3:$G6),$G$3:$G$214,0)),\"\")","v":"Bangladesh"},null,null,null,"AO","angola","Africa","West Africa"]
["BZ","Belize","Central America",null,null,1,{"$f":"IF(F7=1,COUNTIF($F$3:$F7,1),\"\")","v":5},{"$f":"IFERROR(INDEX($B$3:$B$215,MATCH(ROWS($G$3:$G7),$G$3:$G$214,0)),\"\")","v":"Belize"},null,null,null,"AI","anguilla","-"]
["BJ","Benin","Africa","West Africa",null,1,{"$f":"IF(F8=1,COUNTIF($F$3:$F8,1),\"\")","v":6},{"$f":"IFERROR(INDEX($B$3:$B$215,MATCH(ROWS($G$3:$G8),$G$3:$G$214,0)),\"\")","v":"Benin"},null,null,null,"AG","antigua and barbuda","-"]
["BR","Brazil","South America","South America East Coast",null,1,{"$f":"IF(F9=1,COUNTIF($F$3:$F9,1),\"\")","v":7},{"$f":"IFERROR(INDEX($B$3:$B$215,MATCH(ROWS($G$3:$G9),$G$3:$G$214,0)),\"\")","v":"Brazil"},null,null,null,"AR","argentina","South America","South America East Coast"]
["BN","Brunei Darussalam","APAC","Far East",null,1,{"$f":"IF(F10=1,COUNTIF($F$3:$F10,1),\"\")","v":8},{"$f":"IFERROR(INDEX($B$3:$B$215,MATCH(ROWS($G$3:$G10),$G$3:$G$214,0)),\"\")","v":"Brunei Darussalam"},null,null,null,"AM","armenia","Europe"]
["KH","Cambodia","APAC","Far East",null,1,{"$f":"IF(F11=1,COUNTIF($F$3:$F11,1),\"\")","v":9},{"$f":"IFERROR(INDEX($B$3:$B$215,MATCH(ROWS($G$3:$G11),$G$3:$G$214,0)),\"\")","v":"Cambodia"},null,null,null,"AW","aruba","-"]
["CM","Cameroon","Africa","West Africa",null,1,{"$f":"IF(F12=1,COUNTIF($F$3:$F12,1),\"\")","v":10},{"$f":"IFERROR(INDEX($B$3:$B$215,MATCH(ROWS($G$3:$G12),$G$3:$G$214,0)),\"\")","v":"Cameroon"}]
["CA","Canada","North America","CA",null,1,{"$f":"IF(F13=1,COUNTIF($F$3:$F13,1),\"\")","v":11},{"$f":"IFERROR(INDEX($B$3:$B$215,MATCH(ROWS($G$3:$G13),$G$3:$G$214,0)),\"\")","v":"Canada"},null,null,null,"AT","austria","Europe"]
["CL","Chile","South America","South America West Coast",null,1,{"$f":"IF(F14=1,COUNTIF($F$3:$F14,1),\"\")","v":12},{"$f":"IFERROR(INDEX($B$3:$B$215,MATCH(ROWS($G$3:$G14),$G$3:$G$214,0)),\"\")","v":"Chile"},null,null,null,"AZ","azerbaijan","Europe"]
["CN","China","APAC","Far East",null,1,{"$f":"IF(F15=1,COUNTIF($F$3:$F15,1),\"\")","v":13},{"$f":"IFERROR(INDEX($B$3:$B$215,MATCH(ROWS($G$3:$G15),$G$3:$G$214,0)),\"\")","v":"China"},null,null,null,"BY","belarus","Europe"]
["CO","Colombia","South America","South America East Coast",null,1,{"$f":"IF(F16=1,COUNTIF($F$3:$F16,1),\"\")","v":14},{"$f":"IFERROR(INDEX($B$3:$B$215,MATCH(ROWS($G$3:$G16),$G$3:$G$214,0)),\"\")","v":"Colombia"},null,null,null,"BE","belgium","Europe"]
["KM","Comoros","Africa","East Africa",null,1,{"$f":"IF(F17=1,COUNTIF($F$3:$F17,1),\"\")","v":15},{"$f":"IFERROR(INDEX($B$3:$B$215,MATCH(ROWS($G$3:$G17),$G$3:$G$214,0)),\"\")","v":"Comoros"},null,null,null,"BA","bosnia and herzegovina","Europe"]
["CR","Costa Rica","Central America",null,null,1,{"$f":"IF(F18=1,COUNTIF($F$3:$F18,1),\"\")","v":16},{"$f":"IFERROR(INDEX($B$3:$B$215,MATCH(ROWS($G$3:$G18),$G$3:$G$214,0)),\"\")","v":"Costa Rica"},null,null,null,"BG","bulgaria","Europe"]
["CY","Cyprus","Mediterranean",null,null,1,{"$f":"IF(F19=1,COUNTIF($F$3:$F19,1),\"\")","v":17},{"$f":"IFERROR(INDEX($B$3:$B$215,MATCH(ROWS($G$3:$G19),$G$3:$G$214,0)),\"\")","v":"Cyprus"},null,null,null,"BI","burundi","Europe"]
["CD","Democratic Republic Of The Congo","Africa","West Africa",null,1,{"$f":"IF(F20=1,COUNTIF($F$3:$F20,1),\"\")","v":18},{"$f":"IFERROR(INDEX($B$3:$B$215,MATCH(ROWS($G$3:$G20),$G$3:$G$214,0)),\"\")","v":"Democratic Republic Of The Congo"},null,null,null,"HR","croatia","Europe"]
{"$rows_left_out":107}
{"sheet":"PORTS","index":6,"n_rows":606,"n_cols":25,"rows_kept":606,"cut":false,"hidden":true,"merged":[]}
["Country Code","Port Code","Port Name","Combined Port Name and Port Code",null,"Country Name","Country Code","Ports"]
["JP","JPABA","Abashiri, Hokkaido",{"$f":"_xlfn.CONCAT(C2&\" - \"&B2)","v":"Abashiri, Hokkaido - JPABA"},{"$f":"\"PORTS!D2:D\"&COUNTA(D:D)","v":"PORTS!D2:D606"},{"$f":"#REF!","v":{"$error":"#REF!"}},{"$f":"_xlfn.XLOOKUP(F2,GEO!B:B,GEO!A:A)","v":{"$error":"#REF!"}},{"$f":"IFERROR(_xlfn._xlws.FILTER(C2:C6716,A2:A6716=G2),\"\")","v":""},{"$f":"\"PORTS!H2:H\"&COUNTA(H:H)","v":"PORTS!H2:H2"}]
["CI","CIABJ","Abidjan","Abidjan - CIABJ"]
["JP","JPABO","Aboshi, Hyogo","Aboshi, Hyogo - JPABO"]
["AE","AEAUH","Abu Dhabi","Abu Dhabi - AEAUH"]
["JP","JPABU","Aburatsu, Miyazaki","Aburatsu, Miyazaki - JPABU"]
["SV","SVAQJ","Acajutla","Acajutla - SVAQJ"]
["MX","MXACA","Acapulco, Gro","Acapulco, Gro - MXACA"]
["GH","GHACC","Accra","Accra - GHACC"]
["AU","AUADL","Adelaide, Sa","Adelaide, Sa - AUADL",null,null,null,null,null,null,{"$f":"\"No port specific additionals to/from \"& PROPER(#REF!)&\" was found\"","v":{"$error":"#REF!"}}]
["YE","YEADE","Aden","Aden - YEADE"]
["MA","MAAGA","Agadir","Agadir - MAAGA",null,null,null,null,null,{"$f":"COUNT(I14:I27)","v":0}]
["JP","JPAIN","Ainoura, Nagasaki","Ainoura, Nagasaki - JPAIN",null,null,null,null,null,null,{"$f":"IF(J15=\"\",\"\",J15)","v":""}]
["JP","JPAIO","Aioi, Hyogo","Aioi, Hyogo - JPAIO",null,null,null,null,{"$f":"IF(K13=\"\",\"\",COUNTA($K$13:K13))","v":""},null,"Additionals","Region","Sub-region","Country","Port","LCL Currency","LCL Cost","LCL Calc Unit","FCL Currency","FCL Cost","FCL Calc Unit","Validity Calc","Validity Date","Validity Date"]
["JP","JPAXT","Akita, Akita","Akita, Akita - JPAXT",null,null,null,null,{"$f":"IF(J15=\"\",\"\",COUNTA($J$14:J15)+1)","v":""},{"$f":"IF(L15=\"\",\"\",\"Export\")","v":""},{"$f":"_xlfn.XLOOKUP(Y15,#REF!,#REF!,\"\")","v":{"$error":"#REF!"}},null,null,null,null,null,null,null,null,null,null,null,null,{"$f":"IFERROR(IF(W15=\"\",\"\",IF(W15<>0,W15,_xlfn.XLOOKUP(Y15,#REF!,#REF!))),\"\")","v":""},1]
["AU","AUALH","Albany, Wa","Albany, Wa - AUALH",null,null,null,null,{"$f":"IF(J16=\"\",\"\",COUNTA($J$14:J16)+1)","v":""},{"$f":"IF(L16=\"\",\"\",\"Export\")","v":""},{"$f":"_xlfn.XLOOKUP(Y16,#REF!,#REF!,\"\")","v":{"$error":"#REF!"}},null,null,null,null,null,null,null,null,null,null,null,null,{"$f":"IFERROR(IF(W16=\"\",\"\",IF(W16<>0,W16,_xlfn.XLOOKUP(Y16,#REF!,#REF!))),\"\")","v":""},2]
["EG","EGALY","Alexandria","Alexandria - EGALY",null,null,null,null,{"$f":"IF(J17=\"\",\"\",COUNTA($J$14:J17)+1)","v":""},{"$f":"IF(L17=\"\",\"\",\"Export\")","v":""},{"$f":"_xlfn.XLOOKUP(Y17,#REF!,#REF!,\"\")","v":{"$error":"#REF!"}},null,null,null,null,null,null,null,null,null,null,null,null,{"$f":"IFERROR(IF(W17=\"\",\"\",IF(W17<>0,W17,_xlfn.XLOOKUP(Y17,#REF!,#REF!))),\"\")","v":""},3]
["DZ","DZALG","Alger","Alger - DZALG",null,null,null,null,{"$f":"IF(J18=\"\",\"\",COUNTA($J$14:J18)+1)","v":""},{"$f":"IF(L18=\"\",\"\",\"Export\")","v":""},{"$f":"_xlfn.XLOOKUP(Y18,#REF!,#REF!,\"\")","v":{"$error":"#REF!"}},null,null,null,null,null,null,null,null,null,null,null,null,{"$f":"IFERROR(IF(W18=\"\",\"\",IF(W18<>0,W18,_xlfn.XLOOKUP(Y18,#REF!,#REF!))),\"\")","v":""},4]
["MX","MXATM","Altamira","Altamira - MXATM",null,null,null,null,{"$f":"IF(J19=\"\",\"\",COUNTA($J$14:J19)+1)","v":""},{"$f":"IF(L19=\"\",\"\",\"Export\")","v":""},{"$f":"_xlfn.XLOOKUP(Y19,#REF!,#REF!,\"\")","v":{"$error":"#REF!"}},null,null,null,null,null,null,null,null,null,null,null,null,{"$f":"IFERROR(IF(W19=\"\",\"\",IF(W19<>0,W19,_xlfn.XLOOKUP(Y19,#REF!,#REF!))),\"\")","v":""},5]
["JP","JPAMA","Amagasaki, Hyogo","Amagasaki, Hyogo - JPAMA"]
{"$rows_left_out":586}